Target
Somatostatin receptor type 2
Ligand
BDBM82460
Substrate
Ki
0.42±n/a nM
Comments
PDSP_1763
Citation
 Hoyer, DLübbert, HBruns, C Molecular pharmacology of somatostatin receptors. Naunyn Schmiedebergs Arch Pharmacol 350:441-53 (1994)  
Target
Name:
Somatostatin receptor type 2
Synonyms:
SOMATOSTATIN SST2 Smstr2 Somatostatin receptor 2 Sst2 | Sstr2
Type:
Enzyme Catalytic Domain
Mol. Mass.:
41234.26
Organism:
MOUSE
Description:
SOMATOSTATIN SST2 SSTR2 MOUSE::P30875
Residue:
369
  
Inhibitor
Name:
BDBM82460
Synonyms:
L-Ser-L-Ala-L-Asn-L-Ser-L-Asn-L-Pro-L-Ala-L-Met-L-Ala-L-Pro-L-Arg-L-Glu-L-Arg-L-Lys-L-Ala-Gly-L-Cys(1)-L-Lys-L-Asn-L-Phe-L-Phe-L-Trp-L-Lys-L-Thr-L-Phe-L-Thr-L-Ser-L-Cys(1)-OH | somatostatin-28
Type:
Small organic molecule
Emp. Form.:
C137H207N41O39S3
Mol. Mass.:
3148.556
SMILES:
CSCCC(NC(=O)C(C)NC(=O)C1CCCN1C(=O)C(CC(N)=O)NC(=O)C(CO)NC(=O)C(CC(N)=O)NC(=O)C(C)NC(=O)C(N)CO)C(=O)NC(C)C(=O)N1CCC[C@H]1C(=O)NC(CCCN=C(N)N)C(=O)NC(CCC(O)=O)C(=O)NC(CCCN=C(N)N)C(=O)NC(CCCCN)C(=O)NC(C)C(=O)NCC(=O)N[C@H]1CSSC[C@@H](NC(=O)[C@@H](CO)NC(=O)[C@H](NC(=O)[C@@H](Cc2ccccc2)NC(=O)[C@@H](NC(=O)C(CCCCN)NC(=O)[C@@H](Cc2c[nH]c3ccccc23)NC(=O)C(Cc2ccccc2)NC(=O)C(Cc2ccccc2)NC(=O)C(CC(N)=O)NC(=O)C(CCCCN)NC1=O)[C@H](C)O)[C@H](C)O)C(O)=O
: