Target
Thromboxane A2 receptor
Ligand
BDBM82513
Substrate
Ki
117±n/a nM
Comments
PDSP_986
Citation
 D'Angelo, DDDavis, MGAli, SDorn, GW Cloning and pharmacologic characterization of a thromboxane A2 receptor from K562 (human chronic myelogenous leukemia) cells. J Pharmacol Exp Ther 271:1034-41 (1994) Target
Name:
Thromboxane A2 receptor
Synonyms:
Prostanoid TP receptor TBXA2R Thromboxane Thromboxane Beta
Type:
Enyzme
Mol. Mass.:
37445.28
Organism:
Homo sapiens (Human)
Description:
P21731
Residue:
343
  
Inhibitor
Name:
BDBM82513
Synonyms:
CAS_122979 NSC_122979
Type:
Small organic molecule
Emp. Form.:
C25H36INO4
Mol. Mass.:
541.4621
SMILES:
CC1(C)C2CC1C(CC=CCCCC(O)=O)C(C2)NCC(O)Cc1ccc(O)c(I)c1
: