Target
Adenosine receptor A1
Ligand
BDBM82537
Substrate
Ki
154±n/a nM
Comments
PDSP_2593
Citation
 van Galen, PJvan Bergen, AHGallo-Rodriguez, CMelman, NOlah, MEIJzerman, APStiles, GLJacobson, KA A binding site model and structure-activity relationships for the rat A3 adenosine receptor. Mol Pharmacol 45:1101-11 (1994) Target
Name:
Adenosine receptor A1
Synonyms:
AA1R_RAT ADENOSINE A1 high Adenosine A1 receptor (A1) Adenosine receptors A1 | Adora1
Type:
Protein
Mol. Mass.:
36704.13
Organism:
Rattus norvegicus (rat)
Description:
Residue:
326
  
Inhibitor
Name:
BDBM82537
Synonyms:
NECA-N1-oxide
Type:
Small organic molecule
Emp. Form.:
C13H20N6O6
Mol. Mass.:
356.3345
SMILES:
CCNC(=O)OC[C@H]1OC([C@H](O)[C@@H]1O)n1cnc2C(N)N(O)C=Nc12
: