Target
Muscarinic acetylcholine receptor M1
Ligand
BDBM50073444
Substrate
Ki
>10000±n/a nM
Comments
PDSP_1905
Citation
 Stanton, TBolden-Watson, CCusack, BRichelson, E Antagonism of the five cloned human muscarinic cholinergic receptors expressed in CHO-K1 cells by antidepressants and antihistaminics. Biochem Pharmacol 45:2352-4 (1993)  
Target
Name:
Muscarinic acetylcholine receptor M1
Synonyms:
ACM1_HUMAN Cholinergic receptor, muscarinic 1 | Cholinergic, muscarinic M1
Type:
Protein
Mol. Mass.:
51442.54
Organism:
Homo sapiens (Human)
Description:
P11229
Residue:
460
  
Inhibitor
Name:
BDBM50073444
Synonyms:
2-{3-[4-(3-chlorophenyl)piperazin-1-yl]propyl}[1,2,4]triazolo[4,3-a]pyridin-3(2H)-one TRAZODONE
Type:
Small organic molecule
Emp. Form.:
C19H22ClN5O
Mol. Mass.:
371.864
SMILES:
Clc1cccc(c1)N1CCN(CCCn2nc3ccccn3c2=O)CC1
: