Target
Muscarinic acetylcholine receptor M5
Ligand
BDBM82217
Substrate
Ki
1900±n/a nM
Comments
PDSP_1710
Citation
 Stanton, TBolden-Watson, CCusack, BRichelson, E Antagonism of the five cloned human muscarinic cholinergic receptors expressed in CHO-K1 cells by antidepressants and antihistaminics. Biochem Pharmacol 45:2352-4 (1993)  
Target
Name:
Muscarinic acetylcholine receptor M5
Synonyms:
ACM5_HUMAN | CHRM5
Type:
PROTEIN
Mol. Mass.:
60102.35
Organism:
Homo sapiens (Human)
Description:
ChEMBL_1517990
Residue:
532
  
Inhibitor
Name:
BDBM82217
Synonyms:
CHEMBL284994 SERTRALINE | [4-(3,4-Dichloro-phenyl)-1,2,3,4-tetrahydro-naphthalen-1-yl]-methyl-amine
Type:
Emp. Form.:
C17H17Cl2N
Mol. Mass.:
306.23
SMILES:
CN[C@@H]1CC[C@@H](c2ccc(Cl)c(Cl)c2)c2ccccc12
: