Target
Glucose-6-phosphate dehydrogenase-6-phosphogluconolactonase
Ligand
BDBM81054
Substrate
Meas. Tech.
Dose Response orthogonal assay utilizing the direct end-point detection of NADPH for uHTS small molecule inhibitors of Plasmodium falciparum Glucose-6-phosphate dehydrogenase
IC50
>80000±n/a nM
Citation
 PubChem, PC Dose Response orthogonal assay utilizing the direct end-point detection of NADPH for uHTS small molecule inhibitors of Plasmodium falciparum Glucose-6-phosphate dehydrogenase PubChem Bioassay (2011)[AID] 
Target
Name:
Glucose-6-phosphate dehydrogenase-6-phosphogluconolactonase
Synonyms:
Type:
Enzyme Catalytic Domain
Mol. Mass.:
109731.64
Organism:
Plasmodium falciparum 3D7
Description:
gi_12381848
Residue:
950
  
Inhibitor
Name:
BDBM81054
Synonyms:
3-[(2-chlorophenyl)sulfamoyl]-N-[(3-methyl-2-thienyl)methyleneamino]benzamide 3-[(2-chlorophenyl)sulfamoyl]-N-[(3-methylthiophen-2-yl)methylideneamino]benzamide SMR000241431 | cid_2085117
Type:
Small organic molecule
Emp. Form.:
C19H16ClN3O3S2
Mol. Mass.:
433.932
SMILES:
Cc1ccsc1C=NNC(=O)c1cccc(c1)S(=O)(=O)Nc1ccccc1Cl
: