Target
Carboxy-terminal domain RNA polymerase II polypeptide A small phosphatase 1
Ligand
BDBM29658
Substrate
Meas. Tech.
Dose Response confirmation of uHTS hits for Scp-1 phosphatase using a colorimetric assay
IC50
5584±402 nM
Citation
 PubChem, PC Dose Response confirmation of uHTS hits for Scp-1 phosphatase using a colorimetric assay PubChem Bioassay (2011)[AID] 
Target
Name:
Carboxy-terminal domain RNA polymerase II polypeptide A small phosphatase 1
Synonyms:
CTDS1_HUMAN NIF3 SCP1 | carboxy-terminal domain RNA polymerase II polypeptide A small phosphatase 1 isoform 1
Type:
Enzyme Catalytic Domain
Mol. Mass.:
29199.89
Organism:
Homo sapiens (Human)
Description:
gi_10864009
Residue:
261
  
Inhibitor
Name:
BDBM29658
Synonyms:
MLS000557330 N-[3-cyano-1-(2-furanylmethyl)-10-methyl-5-oxo-2-dipyrido[3,4-c:1',2'-f]pyrimidinylidene]-3-methylbenzamide N-[3-cyano-1-(furan-2-ylmethyl)-10-methyl-5-oxidanylidene-dipyrido[3,4-c:1',2'-f]pyrimidin-2-ylidene]-3-methyl-benzamide SMR000148247 | cid_4522020
Type:
Small organic molecule
Emp. Form.:
C26H19N5O3
Mol. Mass.:
449.4608
SMILES:
Cc1cccc(c1)C(=O)\N=c1/c(cc2c(nc3c(C)cccn3c2=O)n1Cc1ccco1)C#N
: