Target
Gag-Pol polyprotein [588-1027]/[588-1147]
Ligand
BDBM3126
Substrate
(poly)rC:(oligo)dG
Meas. Tech.
HIV-1 RT Assay
pH
8.2±n/a
IC50
1400±n/a nM
Citation
 Wai, JSWilliams, TMBamberger, DLFisher, TEHoffman, JMHudcosky, RJMacTough, SCRooney, CSSaari, WSThomas, CM Synthesis and evaluation of 2-pyridinone derivatives as specific HIV-1 reverse transcriptase inhibitors. 3. Pyridyl and phenyl analogs of 3-aminopyridin-2(1H)-one. J Med Chem 36:249-55 (1993)  
Target
Name:
Gag-Pol polyprotein [588-1027]/[588-1147]
Synonyms:
EC: 2.7.7.49 | HIV-1 Reverse Transcriptase
Type:
Protein Complex
Mol. Mass.:
115684
Description:
Components:
This complex has 2 components.
Component 1
Name:
Gag-Pol polyprotein [588-1147]
Synonyms:
HIV-1 Reverse Transcriptase Chain A gag-pol
Type:
Enzyme Subunit
Mol. Mass.:
64486.41
Organism:
Human immunodeficiency virus type 1
Description:
P04585[588-1147]
Residue:
560
  
Component 2
Name:
Gag-Pol polyprotein [588-1027]
Synonyms:
HIV-1 Reverse Transcriptase Chain B gag-pol
Type:
Enzyme Subunit
Mol. Mass.:
51337.13
Organism:
Human immunodeficiency virus type 1
Description:
P04585[588-1027]
Residue:
440
  
Inhibitor
Name:
BDBM3126
Synonyms:
2-pyridinone deriv. 32 | 5-ethyl-3-{[(2-fluorophenyl)methyl]amino}-6-methyl-1,2-dihydropyridin-2-one
Type:
Small organic molecule
Emp. Form.:
C15H17FN2O
Mol. Mass.:
260.3067
SMILES:
CCc1cc(NCc2ccccc2F)c(=O)[nH]c1C
:
Substrate
Name:
(poly)rC:(oligo)dG
Synonyms:
Type:
RNA-DNA duplex
Mol. Mass.:
358.43
Organism:
Description:
The incorporation of Tritium-labeled [3H]dGTP onto a (poly)rC:(oligo)dG template:primer.
Residue:
3
NA