Target
Endoribonuclease toxin MazF
Ligand
BDBM47577
Substrate
Meas. Tech.
Dose response confirmation uHTS hits for MazEF TA System activators via a fluorescence-based single-stranded RNase assay
EC50
>99000±n/a nM
Citation
 PubChem, PC Dose response confirmation uHTS hits for MazEF TA System activators via a fluorescence-based single-stranded RNase assay PubChem Bioassay (2011)[AID] 
Target
Name:
Endoribonuclease toxin MazF
Synonyms:
MAZF_ECOLI chpAK mazF
Type:
Enzyme Catalytic Domain
Mol. Mass.:
12100.43
Organism:
Escherichia coli str. K-12 substr. MG1655
Description:
gi_16130689
Residue:
111
  
Inhibitor
Name:
BDBM47577
Synonyms:
(5Z)-3-ethyl-2-sulfanylidene-5-[(1,2,5-trimethyl-3-pyrrolyl)methylidene]-4-thiazolidinone (5Z)-3-ethyl-2-thioxo-5-[(1,2,5-trimethylpyrrol-3-yl)methylene]thiazolidin-4-one MLS000576648 cid_2584707
Type:
Small organic molecule
Emp. Form.:
C13H16N2OS2
Mol. Mass.:
280.409
SMILES:
CCN1C(=S)S\C(=C/c2cc(C)n(C)c2C)C1=O
: