Target
Endoribonuclease toxin MazF
Ligand
BDBM43814
Substrate
Meas. Tech.
Dose response confirmation uHTS hits for MazEF TA System activators via a fluorescence-based single-stranded RNase assay
EC50
44900±n/a nM
Citation
 PubChem, PC Dose response confirmation uHTS hits for MazEF TA System activators via a fluorescence-based single-stranded RNase assay PubChem Bioassay (2011)[AID] 
Target
Name:
Endoribonuclease toxin MazF
Synonyms:
MAZF_ECOLI chpAK mazF
Type:
Enzyme Catalytic Domain
Mol. Mass.:
12100.43
Organism:
Escherichia coli str. K-12 substr. MG1655
Description:
gi_16130689
Residue:
111
  
Inhibitor
Name:
BDBM43814
Synonyms:
(3Z)-1-butyl-3-[(2-hydroxyphenyl)hydrazinylidene]-2-indolone (3Z)-1-butyl-3-[(2-hydroxyphenyl)hydrazono]oxindole cid_25199560
Type:
Small organic molecule
Emp. Form.:
C18H19N3O2
Mol. Mass.:
309.3624
SMILES:
CCCCN1C(=O)C(=NNc2ccccc2O)c2ccccc12
: