Target
Orotidine 5'-phosphate decarboxylase
Ligand
BDBM83724
Substrate
Meas. Tech.
Luminescence-based cell-based high throughput dose response assay for activators of the GAA850 frataxin (FXN) promoter
EC50
>59640±n/a nM
Citation
 PubChem, PC Luminescence-based cell-based high throughput dose response assay for activators of the GAA850 frataxin (FXN) promoter PubChem Bioassay (2011)[AID] 
Target
Name:
Orotidine 5'-phosphate decarboxylase
Synonyms:
FXN frataxin pyrA | pyrG
Type:
Enzyme Catalytic Domain
Mol. Mass.:
30195.13
Organism:
Aspergillus niger
Description:
gi_2395
Residue:
277
  
Inhibitor
Name:
BDBM83724
Synonyms:
7-Butyl-8-(4-chloro-benzylsulfanyl)-3-methyl-3,7-dihydro-purine-2,6-dione 7-butyl-8-[(4-chlorophenyl)methylsulfanyl]-3-methyl-purine-2,6-dione 7-butyl-8-[(4-chlorophenyl)methylthio]-3-methylpurine-2,6-dione SMR000009753 | cid_651471
Type:
Small organic molecule
Emp. Form.:
C17H19ClN4O2S
Mol. Mass.:
378.876
SMILES:
CCCCn1c(SCc2ccc(Cl)cc2)nc2n(C)c(=O)[nH]c(=O)c12
: