Target
Orotidine 5'-phosphate decarboxylase
Ligand
BDBM83726
Substrate
Meas. Tech.
Luminescence-based cell-based high throughput dose response assay for activators of the GAA850 frataxin (FXN) promoter
EC50
>59587±n/a nM
Citation
 PubChem, PC Luminescence-based cell-based high throughput dose response assay for activators of the GAA850 frataxin (FXN) promoter PubChem Bioassay (2011)[AID] 
Target
Name:
Orotidine 5'-phosphate decarboxylase
Synonyms:
FXN frataxin pyrA | pyrG
Type:
Enzyme Catalytic Domain
Mol. Mass.:
30195.13
Organism:
Aspergillus niger
Description:
gi_2395
Residue:
277
  
Inhibitor
Name:
BDBM83726
Synonyms:
8-(4-Chloro-benzylsulfanyl)-3-methyl-7-propyl-3,7-dihydro-purine-2,6-dione 8-[(4-chlorophenyl)methylsulfanyl]-3-methyl-7-propyl-purine-2,6-dione 8-[(4-chlorophenyl)methylthio]-3-methyl-7-propylpurine-2,6-dione SMR000009145 | cid_654875
Type:
Small organic molecule
Emp. Form.:
C16H17ClN4O2S
Mol. Mass.:
364.85
SMILES:
CCCn1c(SCc2ccc(Cl)cc2)nc2n(C)c(=O)[nH]c(=O)c12
: