Target
Orotidine 5'-phosphate decarboxylase
Ligand
BDBM83729
Substrate
Meas. Tech.
Luminescence-based cell-based high throughput dose response assay for activators of the GAA850 frataxin (FXN) promoter
EC50
>59658±n/a nM
Citation
 PubChem, PC Luminescence-based cell-based high throughput dose response assay for activators of the GAA850 frataxin (FXN) promoter PubChem Bioassay (2011)[AID] 
Target
Name:
Orotidine 5'-phosphate decarboxylase
Synonyms:
FXN frataxin pyrA | pyrG
Type:
Enzyme Catalytic Domain
Mol. Mass.:
30195.13
Organism:
Aspergillus niger
Description:
gi_2395
Residue:
277
  
Inhibitor
Name:
BDBM83729
Synonyms:
MLS000030492 cid_659787
Type:
Small organic molecule
Emp. Form.:
C24H24N4O4S2
Mol. Mass.:
496.602
SMILES:
COC(=O)c1ccc(CSc2ncnc3c2sc2nc(N4CCOCC4)c4CCCCc4c32)o1
: