Target
Orotidine 5'-phosphate decarboxylase
Ligand
BDBM83735
Substrate
Meas. Tech.
Luminescence-based cell-based high throughput dose response assay for activators of the GAA850 frataxin (FXN) promoter
EC50
>59629±n/a nM
Citation
 PubChem, PC Luminescence-based cell-based high throughput dose response assay for activators of the GAA850 frataxin (FXN) promoter PubChem Bioassay (2011)[AID] 
Target
Name:
Orotidine 5'-phosphate decarboxylase
Synonyms:
FXN frataxin pyrA | pyrG
Type:
Enzyme Catalytic Domain
Mol. Mass.:
30195.13
Organism:
Aspergillus niger
Description:
gi_2395
Residue:
277
  
Inhibitor
Name:
BDBM83735
Synonyms:
MLS000082615 cid_664720
Type:
Small organic molecule
Emp. Form.:
C22H24N4O2S
Mol. Mass.:
408.517
SMILES:
CC(C)c1nc2sc3c(NCc4ccco4)ncnc3c2c2CC(C)(C)OCc12
: