Target
Orotidine 5'-phosphate decarboxylase
Ligand
BDBM47557
Substrate
Meas. Tech.
Luminescence-based cell-based high throughput dose response assay for activators of the GAA850 frataxin (FXN) promoter
EC50
>59657±n/a nM
Citation
 PubChem, PC Luminescence-based cell-based high throughput dose response assay for activators of the GAA850 frataxin (FXN) promoter PubChem Bioassay (2011)[AID] 
Target
Name:
Orotidine 5'-phosphate decarboxylase
Synonyms:
FXN frataxin pyrA | pyrG
Type:
Enzyme Catalytic Domain
Mol. Mass.:
30195.13
Organism:
Aspergillus niger
Description:
gi_2395
Residue:
277
  
Inhibitor
Name:
BDBM47557
Synonyms:
2-(cyclooctylamino)-9,10-dimethoxy-6,7-dihydropyrimid[6,1-a]isoquinolin-4-one MLS000041512 cid_665008
Type:
Small organic molecule
Emp. Form.:
C22H29N3O3
Mol. Mass.:
383.484
SMILES:
COc1cc2CCn3c(cc(NC4CCCCCCC4)nc3=O)-c2cc1OC
: