Target
Orotidine 5'-phosphate decarboxylase
Ligand
BDBM83736
Substrate
Meas. Tech.
Luminescence-based cell-based high throughput dose response assay for activators of the GAA850 frataxin (FXN) promoter
EC50
>59671±n/a nM
Citation
 PubChem, PC Luminescence-based cell-based high throughput dose response assay for activators of the GAA850 frataxin (FXN) promoter PubChem Bioassay (2011)[AID] 
Target
Name:
Orotidine 5'-phosphate decarboxylase
Synonyms:
FXN frataxin pyrA | pyrG
Type:
Enzyme Catalytic Domain
Mol. Mass.:
30195.13
Organism:
Aspergillus niger
Description:
gi_2395
Residue:
277
  
Inhibitor
Name:
BDBM83736
Synonyms:
(3Z)-5-[2-(3,4-dimethoxyphenyl)ethyl]-3-(6-oxidanylidenecyclohexa-2,4-dien-1-ylidene)-4-phenyl-2,4-dihydro-1H-pyrrolo[3,4-c]pyrazol-6-one (3Z)-5-[2-(3,4-dimethoxyphenyl)ethyl]-3-(6-oxocyclohexa-2,4-dien-1-ylidene)-4-phenyl-2,4-dihydro-1H-pyrrolo[3,4-c]pyrazol-6-one MLS000084109 cid_5389982
Type:
Small organic molecule
Emp. Form.:
C27H25N3O4
Mol. Mass.:
455.5051
SMILES:
COc1ccc(CCN2C(c3c(n[nH]c3C2=O)-c2ccccc2O)c2ccccc2)cc1OC
: