Target
Apoptotic protease-activating factor 1
Ligand
BDBM30762
Substrate
Meas. Tech.
Dose response confirmation of uHTS hits for Apaf-1 in a Fluorescent assay
IC50
18800±n/a nM
Citation
 PubChem, PC Dose response confirmation of uHTS hits for Apaf-1 in a Fluorescent assay PubChem Bioassay (2011)[AID] 
Target
Name:
Apoptotic protease-activating factor 1
Synonyms:
APAF1 Apoptotic peptidase activating factor 1 | KIAA0413
Type:
Enzyme Catalytic Domain
Mol. Mass.:
141834.40
Organism:
Homo sapiens (Human)
Description:
O14727
Residue:
1248
  
Inhibitor
Name:
BDBM30762
Synonyms:
2-amino-N-butan-2-yl-1-(2-oxolanylmethyl)-3-pyrrolo[3,2-b]quinoxalinecarboxamide 2-amino-N-sec-butyl-1-(tetrahydrofurfuryl)pyrrolo[3,2-b]quinoxaline-3-carboxamide MLS000040979 cid_662288
Type:
Small organic molecule
Emp. Form.:
C20H25N5O2
Mol. Mass.:
367.4448
SMILES:
CCC(C)NC(=O)c1c(N)n(CC2CCCO2)c2nc3ccccc3nc12
: