Target
Apoptotic protease-activating factor 1
Ligand
BDBM83881
Substrate
Meas. Tech.
Dose response confirmation of uHTS hits for Apaf-1 in a Fluorescent assay
IC50
10000±n/a nM
Citation
 PubChem, PC Dose response confirmation of uHTS hits for Apaf-1 in a Fluorescent assay PubChem Bioassay (2011)[AID] 
Target
Name:
Apoptotic protease-activating factor 1
Synonyms:
APAF1 Apoptotic peptidase activating factor 1 | KIAA0413
Type:
Enzyme Catalytic Domain
Mol. Mass.:
141834.40
Organism:
Homo sapiens (Human)
Description:
O14727
Residue:
1248
  
Inhibitor
Name:
BDBM83881
Synonyms:
MLS000102452 N-[1-[4-(2-methoxyphenyl)piperazin-1-yl]-1-thiophen-2-yl-propan-2-yl]benzenesulfonamide N-[2-[4-(2-methoxyphenyl)piperazino]-1-methyl-2-(2-thienyl)ethyl]benzenesulfonamide cid_5310496
Type:
Small organic molecule
Emp. Form.:
C24H29N3O3S2
Mol. Mass.:
471.635
SMILES:
COc1ccccc1N1CCN(CC1)C(C(C)NS(=O)(=O)c1ccccc1)c1cccs1
: