Target
Caspase-9
Ligand
BDBM83881
Substrate
Meas. Tech.
Dose response confirmation of uHTS hits for Apaf-1 using a LZ-Caspase-9/Caspase-3 Fluorescent Selectivity assay
IC50
26000±n/a nM
Citation
 PubChem, PC Dose response confirmation of uHTS hits for Apaf-1 using a LZ-Caspase-9/Caspase-3 Fluorescent Selectivity assay PubChem Bioassay (2011)[AID] 
Target
Name:
Caspase-9
Synonyms:
Apoptotic protease-activating factor 1/Caspase-3/Caspase-9/Cytochrome c CASP-9 CASP9_HUMAN ICE-like apoptotic protease 6 caspase-9 isoform alpha preproprotein
Type:
Enzyme
Mol. Mass.:
46277.29
Organism:
Homo sapiens (Human)
Description:
Residue:
416
  
Inhibitor
Name:
BDBM83881
Synonyms:
MLS000102452 N-[1-[4-(2-methoxyphenyl)piperazin-1-yl]-1-thiophen-2-yl-propan-2-yl]benzenesulfonamide N-[2-[4-(2-methoxyphenyl)piperazino]-1-methyl-2-(2-thienyl)ethyl]benzenesulfonamide cid_5310496
Type:
Small organic molecule
Emp. Form.:
C24H29N3O3S2
Mol. Mass.:
471.635
SMILES:
COc1ccccc1N1CCN(CC1)C(C(C)NS(=O)(=O)c1ccccc1)c1cccs1
: