Target
Apoptotic protease-activating factor 1
Ligand
BDBM40956
Substrate
Meas. Tech.
Dose Response validation of Activators of Apaf-1 using a Fluorescent Interference Counterscreen assay
EC50
>100000±0 nM
Citation
 PubChem, PC Dose Response validation of Activators of Apaf-1 using a Fluorescent Interference Counterscreen assay PubChem Bioassay (2011)[AID] 
Target
Name:
Apoptotic protease-activating factor 1
Synonyms:
APAF1 Apoptotic peptidase activating factor 1 | KIAA0413
Type:
Enzyme Catalytic Domain
Mol. Mass.:
141834.40
Organism:
Homo sapiens (Human)
Description:
O14727
Residue:
1248
  
Inhibitor
Name:
BDBM40956
Synonyms:
1-[2-[4-(4-chlorobenzyl)oxyphenyl]-4-cyano-oxazol-5-yl]isonipecotamide 1-[2-[4-[(4-chlorophenyl)methoxy]phenyl]-4-cyano-5-oxazolyl]-4-piperidinecarboxamide SMR000044900 | cid_664100
Type:
Small organic molecule
Emp. Form.:
C23H21ClN4O3
Mol. Mass.:
436.891
SMILES:
NC(=O)C1CCN(CC1)c1oc(nc1C#N)-c1ccc(OCc2ccc(Cl)cc2)cc1
: