Target
D(2) dopamine receptor
Ligand
BDBM84458
Substrate
Meas. Tech.
Binding Assay
Ki
>1000±0.0 nM
Citation
 Hendrix, JAShimshock, SJShutske, GMTomer, JDKapples, KJPalermo, MGCorbett, TJVargas, HMKafka, SBrooks, KMLaws-Ricker, LLee, DKde Lannoy, IBordeleau, MRizkalla, GOwolabi, JKamboj, RK Synthesis and structure-activity relationship of the isoindolinyl benzisoxazolpiperidines as potent, selective, and orally active human dopamine D4 receptor antagonists. Chembiochem 3:999-1009 (2002)  
Target
Name:
D(2) dopamine receptor
Synonyms:
D(2) dopamine receptor DOPAMINE D2 Long DRD2 Dopamine D2 receptor Dopamine D2 receptor (D2R) Dopamine2-like | d2
Type:
Cell-surface receptors
Mol. Mass.:
50647.10
Organism:
Homo sapiens (Human)
Description:
P14416
Residue:
443
  
Inhibitor
Name:
BDBM84458
Synonyms:
Isoindoline, 25
Type:
Small organic molecule
Emp. Form.:
C24H30FN3O3
Mol. Mass.:
427.5117
SMILES:
OCC(CN1C(=C)[C@@H]2CCCC[C@@H]2C1=O)N1CCC(CC1)c1noc2cc(F)ccc12
: