Target
Tyrosine-protein phosphatase non-receptor type 1
Ligand
BDBM84589
Substrate
Meas. Tech.
PTP Assay
Temperature
298.15±0 K
IC50
6.3e+3± 3e+2 nM
Citation
 Stuible, MZhao, LAubry, ISchmidt-Arras, DBöhmer, FDLi, CJTremblay, ML Cellular inhibition of protein tyrosine phosphatase 1B by uncharged thioxothiazolidinone derivatives. Chembiochem 8:179-86 (2007)  
Target
Name:
Tyrosine-protein phosphatase non-receptor type 1
Synonyms:
PTN1_HUMAN PTPN1 Protein tyrosine phosphatase-1B (PTP1B) Protein-tyrosine phosphatase 1B (PTP1B) Tyrosine-protein phosphatase non-receptor type 1 (PTP1B)
Type:
Protein phosphatase
Mol. Mass.:
49963.76
Organism:
Homo sapiens (Human)
Description:
Human recombinant GST-fusion PTP1B (1-435).
Residue:
435
  
Inhibitor
Name:
BDBM84589
Synonyms:
Thioxothiazolidinone derivative, 10
Type:
Small organic molecule
Emp. Form.:
C18H14N2O6S2
Mol. Mass.:
418.444
SMILES:
COc1ccc(cc1)N1C(=S)S\C(=C/c2cc(OC)c(O)c(c2)N(=O)=O)C1=O
: