Target
Tyrosine-protein phosphatase non-receptor type 1
Ligand
BDBM84595
Substrate
Meas. Tech.
PTP Assay
Temperature
298.15±0 K
IC50
7.3e+3± 5e+2 nM
Citation
 Stuible, MZhao, LAubry, ISchmidt-Arras, DBöhmer, FDLi, CJTremblay, ML Cellular inhibition of protein tyrosine phosphatase 1B by uncharged thioxothiazolidinone derivatives. Chembiochem 8:179-86 (2007)  
Target
Name:
Tyrosine-protein phosphatase non-receptor type 1
Synonyms:
PTN1_HUMAN PTPN1 Protein tyrosine phosphatase-1B (PTP1B) Protein-tyrosine phosphatase 1B (PTP1B) Tyrosine-protein phosphatase non-receptor type 1 (PTP1B)
Type:
Protein phosphatase
Mol. Mass.:
49963.76
Organism:
Homo sapiens (Human)
Description:
Human recombinant GST-fusion PTP1B (1-435).
Residue:
435
  
Inhibitor
Name:
BDBM84595
Synonyms:
Thioxothiazolidinone derivative, 17
Type:
Small organic molecule
Emp. Form.:
C18H12ClNO5S2
Mol. Mass.:
421.875
SMILES:
COc1cc(\C=C2/SC(=S)N(C2=O)c2cccc(Cl)c2)cc(C(O)=O)c1O
: