Target
Tyrosine-protein phosphatase non-receptor type 1
Ligand
BDBM84596
Substrate
Meas. Tech.
PTP Assay
Temperature
298.15±0 K
IC50
>1.00e+5±n/a nM
Citation
 Stuible, MZhao, LAubry, ISchmidt-Arras, DBöhmer, FDLi, CJTremblay, ML Cellular inhibition of protein tyrosine phosphatase 1B by uncharged thioxothiazolidinone derivatives. Chembiochem 8:179-86 (2007)  
Target
Name:
Tyrosine-protein phosphatase non-receptor type 1
Synonyms:
PTN1_HUMAN PTPN1 Protein tyrosine phosphatase-1B (PTP1B) Protein-tyrosine phosphatase 1B (PTP1B) Tyrosine-protein phosphatase non-receptor type 1 (PTP1B)
Type:
Protein phosphatase
Mol. Mass.:
49963.76
Organism:
Homo sapiens (Human)
Description:
Human recombinant GST-fusion PTP1B (1-435).
Residue:
435
  
Inhibitor
Name:
BDBM84596
Synonyms:
Thioxothiazolidinone derivative, 18
Type:
Small organic molecule
Emp. Form.:
C18H13ClNO6PS2
Mol. Mass.:
469.857
SMILES:
COc1cc(C=C2SC(=S)N(C2=O)c2cccc(Cl)c2)cc(CP([O-])([O-])=O)c1O
: