Target
Tyrosine-protein phosphatase non-receptor type 13
Ligand
BDBM84581
Substrate
Meas. Tech.
PTP Assay
pH
7±0
Temperature
298.15±0 K
IC50
3.7e+3± 1e+2 nM
Citation
 Stuible, MZhao, LAubry, ISchmidt-Arras, DBöhmer, FDLi, CJTremblay, ML Cellular inhibition of protein tyrosine phosphatase 1B by uncharged thioxothiazolidinone derivatives. Chembiochem 8:179-86 (2007)  
Target
Name:
Tyrosine-protein phosphatase non-receptor type 13
Synonyms:
FAP-1 Fas-associated protein-tyrosine phosphatase 1 (FAP1) PNP1 PTP1E PTPN13 Tyrosine-protein phosphatase non-receptor type 13 | Tyrosine-protein phosphatase non-receptor type 13 (FAP1)
Type:
Protein
Mol. Mass.:
276896.33
Organism:
Homo sapiens (Human)
Description:
Q12923
Residue:
2485
  
Inhibitor
Name:
BDBM84581
Synonyms:
Thioxothiazolidinone derivative, 1
Type:
Small organic molecule
Emp. Form.:
C17H11ClN2O5S2
Mol. Mass.:
422.863
SMILES:
COc1cc(\C=C2/SC(=S)N(C2=O)c2cccc(Cl)c2)cc(c1O)N(=O)=O
: