Target
Somatostatin receptor type 2
Ligand
BDBM84617
Substrate
Ki
6.1±n/a nM
Comments
PDSP_383
Citation
 Raynor, KMurphy, WACoy, DHTaylor, JEMoreau, JPYasuda, KBell, GIReisine, T Cloned somatostatin receptors: identification of subtype-selective peptides and demonstration of high affinity binding of linear peptides. Mol Pharmacol 43:838-44 (1993) Target
Name:
Somatostatin receptor type 2
Synonyms:
SOMATOSTATIN SST2 Smstr2 Somatostatin receptor 2 Sst2 | Sstr2
Type:
Enzyme Catalytic Domain
Mol. Mass.:
41234.26
Organism:
MOUSE
Description:
SOMATOSTATIN SST2 SSTR2 MOUSE::P30875
Residue:
369
  
Inhibitor
Name:
BDBM84617
Synonyms:
BIM 23053 L-Alaninamide,D-phenylalanyl-L-alanyl-L-tyrosyl-D-tryptophyl-L-lysyl-L-valyl-L-alanyl-3-(2-naphthalenyl)-(9CI)
Type:
Small organic molecule
Emp. Form.:
C60H74ClN11O8
Mol. Mass.:
1112.751
SMILES:
CC[C@H](NC(=O)[C@H](N)Cc1ccc(Cl)cc1)C(=O)N[C@@H](Cc1ccccc1)C(=O)N[C@H](Cc1c[nH]c2ccccc12)C(=O)N[C@@H](CCCCN)C(=O)N[C@@H](C(C)C)C(=O)N[C@@H](C)C(=O)N[C@@H](Cc1ccc2ccccc2c1)C(N)=O
: