Target
5-hydroxytryptamine receptor 7
Ligand
BDBM50031942
Substrate
Ki
12.5±n/a nM
Comments
PDSP_1230
Citation
 Shen, YMonsma, FJMetcalf, MAJose, PAHamblin, MWSibley, DR Molecular cloning and expression of a 5-hydroxytryptamine7 serotonin receptor subtype. J Biol Chem 268:18200-4 (1993) Target
Name:
5-hydroxytryptamine receptor 7
Synonyms:
5-HT-7 5-HT7 5-HT7S 5-hydroxytryptamine receptor 7 5HT7R_RAT GPRFO Serotonin (5-HT) receptor | Serotonin Receptor 7
Type:
G Protein-Coupled Receptor (GPCR)
Mol. Mass.:
49852.62
Organism:
Rattus norvegicus (rat)
Description:
Rat cloned 5-HT7R.
Residue:
448
  
Inhibitor
Name:
BDBM50031942
Synonyms:
(6aR,9R)-4,6a,7-Trimethyl-4,6,6a,7,8,9-hexahydro-indolo[4,3-fg]quinoline-9-carboxylic acid (1-hydroxymethyl-propyl)-amide (6aR,9R)-4-Methyl-4,6,6a,7,8,9-hexahydro-indolo[4,3-fg]quinoline-9-carboxylic acid (1-hydroxymethyl-propyl)-amide (methylsergide)4,7-Dimethyl-4,6,6a,7,8,9-hexahydro-indolo[4,3-fg]quinoline-9-carboxylic acid (1-hydroxymethyl-propyl)-amide CHEMBL1065 Sansert
Type:
Small organic molecule
Emp. Form.:
C21H27N3O2
Mol. Mass.:
353.458
SMILES:
CC[C@@H](CO)NC(=O)[C@H]1CN(C)[C@@H]2Cc3cn(C)c4cccc(C2=C1)c34
: