Target
Carbonic anhydrase 7
Ligand
BDBM50239280
Substrate
Meas. Tech.
ChEMBL_1665869 (CHEMBL4015665)
Ki
0.530000±n/a nM
Citation
 Bruno, EBuemi, MRDi Fiore, ADe Luca, LFerro, SAngeli, ACirilli, RSadutto, DAlterio, VMonti, SMSupuran, CTDe Simone, GGitto, R Probing Molecular Interactions between Human Carbonic Anhydrases (hCAs) and a Novel Class of Benzenesulfonamides. J Med Chem 60:4316-4326 (2017)  
Target
Name:
Carbonic anhydrase 7
Synonyms:
CA-VII CAH7_HUMAN Carbonic anhydrase Carbonic anhydrase VII (CA VII)
Type:
Enzyme
Mol. Mass.:
29664.11
Organism:
Homo sapiens (Human)
Description:
Human cloned isozyme.
Residue:
264
  
Inhibitor
Name:
BDBM50239280
Synonyms:
CHEMBL4071251
Type:
Small organic molecule
Emp. Form.:
C24H23FN2O5S
Mol. Mass.:
470.513
SMILES:
COc1cc2CCN(C(c3ccc(F)cc3)c2cc1OC)C(=O)c1ccc(cc1)S(N)(=O)=O
: