Target
Mu-type opioid receptor
Ligand
BDBM50000569
Substrate
Meas. Tech.
ChEMBL_146696 (CHEMBL753773)
Ki
8.8±n/a nM
Citation
 Froimowitz, MPick, CGPasternak, GW Phenylmorphans and analogues: opioid receptor subtype selectivity and effect of conformation on activity. J Med Chem 35:1521-5 (1992)  
Target
Name:
Mu-type opioid receptor
Synonyms:
MOR-1 OPIATE Mu OPRM_BOVIN
Type:
Enzyme Catalytic Domain
Mol. Mass.:
45038.37
Organism:
CALF
Description:
OPIATE Mu 2 0 CALF::P79350
Residue:
401
  
Inhibitor
Name:
BDBM50000569
Synonyms:
5-(3-Hydroxy-phenyl)-2-methyl-2-aza-bicyclo[3.3.1]nonan-9-ol | CHEMBL290855
Type:
Small organic molecule
Emp. Form.:
C15H21NO2
Mol. Mass.:
247.3327
SMILES:
CN1CCC2(CCCC1[C@H]2O)c1cccc(O)c1
: