Target
Kappa-type opioid receptor
Ligand
BDBM50000571
Substrate
Meas. Tech.
ChEMBL_145994 (CHEMBL750588)
Ki
>300±n/a nM
Citation
 Froimowitz, MPick, CGPasternak, GW Phenylmorphans and analogues: opioid receptor subtype selectivity and effect of conformation on activity. J Med Chem 35:1521-5 (1992)  
Target
Name:
Kappa-type opioid receptor
Synonyms:
K-OR-1 Kappa-opioid receptor (KOR) Kappa-type opioid receptor (KOR) OPIATE Kappa OPRK1 kappa opioid receptor (KOR)
Type:
G Protein-Coupled Receptor (GPCR)
Mol. Mass.:
42648.76
Organism:
Homo sapiens (Human)
Description:
P41145
Residue:
380
  
Inhibitor
Name:
BDBM50000571
Synonyms:
3-(2,9-Dimethyl-2-aza-bicyclo[3.3.1]non-5-yl)-phenol CHEMBL287726
Type:
Small organic molecule
Emp. Form.:
C16H23NO
Mol. Mass.:
245.3599
SMILES:
C[C@@H]1C2CCCC1(CCN2C)c1cccc(O)c1
: