Target
Mu-type opioid receptor
Ligand
BDBM50000570
Substrate
Meas. Tech.
ChEMBL_146696 (CHEMBL753773)
Ki
3.40±n/a nM
Citation
 Froimowitz, MPick, CGPasternak, GW Phenylmorphans and analogues: opioid receptor subtype selectivity and effect of conformation on activity. J Med Chem 35:1521-5 (1992)  
Target
Name:
Mu-type opioid receptor
Synonyms:
MOR-1 OPIATE Mu OPRM_BOVIN
Type:
Enzyme Catalytic Domain
Mol. Mass.:
45038.37
Organism:
CALF
Description:
OPIATE Mu 2 0 CALF::P79350
Residue:
401
  
Inhibitor
Name:
BDBM50000570
Synonyms:
3-(2-Methyl-2-aza-bicyclo[3.3.1]non-5-yl)-phenol | CHEMBL285250
Type:
Small organic molecule
Emp. Form.:
C15H21NO
Mol. Mass.:
231.3333
SMILES:
CN1CCC2(CCCC1C2)c1cccc(O)c1
: