Target
Mu-type opioid receptor
Ligand
BDBM50000571
Substrate
Meas. Tech.
ChEMBL_146696 (CHEMBL753773)
Ki
18.0±n/a nM
Citation
 Froimowitz, MPick, CGPasternak, GW Phenylmorphans and analogues: opioid receptor subtype selectivity and effect of conformation on activity. J Med Chem 35:1521-5 (1992)  
Target
Name:
Mu-type opioid receptor
Synonyms:
MOR-1 OPIATE Mu OPRM_BOVIN
Type:
Enzyme Catalytic Domain
Mol. Mass.:
45038.37
Organism:
CALF
Description:
OPIATE Mu 2 0 CALF::P79350
Residue:
401
  
Inhibitor
Name:
BDBM50000571
Synonyms:
3-(2,9-Dimethyl-2-aza-bicyclo[3.3.1]non-5-yl)-phenol CHEMBL287726
Type:
Small organic molecule
Emp. Form.:
C16H23NO
Mol. Mass.:
245.3599
SMILES:
C[C@@H]1C2CCCC1(CCN2C)c1cccc(O)c1
: