Target
D(2) dopamine receptor
Ligand
BDBM50000612
Substrate
Meas. Tech.
ChEBML_62093
Ki
4200±n/a nM
Citation
 Erickson, RHNatalie, KJBock, WLu, ZFarzin, FSherrill, RGMeloni, DJPatch, RJRzesotarski, WJClifton, J (Aminoalkoxy)chromones. Selective sigma receptor ligands. J Med Chem 35:1526-35 (1992)  
Target
Name:
D(2) dopamine receptor
Synonyms:
DOPAMINE D2 DOPAMINE D2 Short Dopamine D2 receptor Drd2
Type:
G Protein-Coupled Receptor (GPCR)
Mol. Mass.:
50931.60
Organism:
Rattus norvegicus (rat)
Description:
P61169
Residue:
444
  
Inhibitor
Name:
BDBM50000612
Synonyms:
6-[5-(4-Hydroxy-piperidin-1-yl)-pentyloxy]-2-(4-methoxy-phenyl)-chromen-4-one | CHEMBL38023
Type:
Small organic molecule
Emp. Form.:
C26H31NO5
Mol. Mass.:
437.528
SMILES:
COc1ccc(cc1)-c1cc(=O)c2cc(OCCCCCN3CCC(O)CC3)ccc2o1
: