Target
D(2) dopamine receptor
Ligand
BDBM50000640
Substrate
Meas. Tech.
ChEBML_62093
Ki
5100±n/a nM
Citation
 Erickson, RHNatalie, KJBock, WLu, ZFarzin, FSherrill, RGMeloni, DJPatch, RJRzesotarski, WJClifton, J (Aminoalkoxy)chromones. Selective sigma receptor ligands. J Med Chem 35:1526-35 (1992)  
Target
Name:
D(2) dopamine receptor
Synonyms:
DOPAMINE D2 DOPAMINE D2 Short Dopamine D2 receptor Drd2
Type:
G Protein-Coupled Receptor (GPCR)
Mol. Mass.:
50931.60
Organism:
Rattus norvegicus (rat)
Description:
P61169
Residue:
444
  
Inhibitor
Name:
BDBM50000640
Synonyms:
5-[5-(4-Hydroxy-piperidin-1-yl)-pentyloxy]-2-phenyl-chromen-4-one | CHEMBL412429
Type:
Small organic molecule
Emp. Form.:
C25H29NO4
Mol. Mass.:
407.5021
SMILES:
OC1CCN(CCCCCOc2cccc3oc(cc(=O)c23)-c2ccccc2)CC1
: