Target
D(2) dopamine receptor
Ligand
BDBM50000605
Substrate
Meas. Tech.
ChEMBL_62093 (CHEMBL674973)
Ki
5600±n/a nM
Citation
 Erickson, RHNatalie, KJBock, WLu, ZFarzin, FSherrill, RGMeloni, DJPatch, RJRzesotarski, WJClifton, J (Aminoalkoxy)chromones. Selective sigma receptor ligands. J Med Chem 35:1526-35 (1992)  
Target
Name:
D(2) dopamine receptor
Synonyms:
DOPAMINE D2 DOPAMINE D2 Short Dopamine D2 receptor Drd2
Type:
G Protein-Coupled Receptor (GPCR)
Mol. Mass.:
50931.60
Organism:
Rattus norvegicus (rat)
Description:
P61169
Residue:
444
  
Inhibitor
Name:
BDBM50000605
Synonyms:
6-(6-Dimethylamino-hexyloxy)-2-phenyl-chromen-4-one | CHEMBL38585
Type:
Small organic molecule
Emp. Form.:
C23H27NO3
Mol. Mass.:
365.4654
SMILES:
CN(C)CCCCCCOc1ccc2oc(cc(=O)c2c1)-c1ccccc1
: