Target
D(2) dopamine receptor
Ligand
BDBM50000577
Substrate
Meas. Tech.
ChEBML_62093
Ki
3800±n/a nM
Citation
 Erickson, RHNatalie, KJBock, WLu, ZFarzin, FSherrill, RGMeloni, DJPatch, RJRzesotarski, WJClifton, J (Aminoalkoxy)chromones. Selective sigma receptor ligands. J Med Chem 35:1526-35 (1992)  
Target
Name:
D(2) dopamine receptor
Synonyms:
DOPAMINE D2 DOPAMINE D2 Short Dopamine D2 receptor Drd2
Type:
G Protein-Coupled Receptor (GPCR)
Mol. Mass.:
50931.60
Organism:
Rattus norvegicus (rat)
Description:
P61169
Residue:
444
  
Inhibitor
Name:
BDBM50000577
Synonyms:
2-(4-Fluoro-phenyl)-6-[6-(4-hydroxy-piperidin-1-yl)-hexyloxy]-chromen-4-one | CHEMBL38565
Type:
Small organic molecule
Emp. Form.:
C26H30FNO4
Mol. Mass.:
439.5191
SMILES:
OC1CCN(CCCCCCOc2ccc3oc(cc(=O)c3c2)-c2ccc(F)cc2)CC1
: