Target
D(2) dopamine receptor
Ligand
BDBM50000642
Substrate
Meas. Tech.
ChEBML_62093
Ki
1300±n/a nM
Citation
 Erickson, RHNatalie, KJBock, WLu, ZFarzin, FSherrill, RGMeloni, DJPatch, RJRzesotarski, WJClifton, J (Aminoalkoxy)chromones. Selective sigma receptor ligands. J Med Chem 35:1526-35 (1992)  
Target
Name:
D(2) dopamine receptor
Synonyms:
DOPAMINE D2 DOPAMINE D2 Short Dopamine D2 receptor Drd2
Type:
G Protein-Coupled Receptor (GPCR)
Mol. Mass.:
50931.60
Organism:
Rattus norvegicus (rat)
Description:
P61169
Residue:
444
  
Inhibitor
Name:
BDBM50000642
Synonyms:
6-{6-[4-(4-Chloro-phenyl)-3,6-dihydro-2H-pyridin-1-yl]-hexyloxy}-2-phenyl-chromen-4-one | CHEMBL39001
Type:
Small organic molecule
Emp. Form.:
C32H32ClNO3
Mol. Mass.:
514.054
SMILES:
Clc1ccc(cc1)C1=CCN(CCCCCCOc2ccc3oc(cc(=O)c3c2)-c2ccccc2)CC1
: