Target
D(2) dopamine receptor
Ligand
BDBM50000579
Substrate
Meas. Tech.
ChEMBL_62093 (CHEMBL674973)
Ki
1000±n/a nM
Citation
 Erickson, RHNatalie, KJBock, WLu, ZFarzin, FSherrill, RGMeloni, DJPatch, RJRzesotarski, WJClifton, J (Aminoalkoxy)chromones. Selective sigma receptor ligands. J Med Chem 35:1526-35 (1992)  
Target
Name:
D(2) dopamine receptor
Synonyms:
DOPAMINE D2 DOPAMINE D2 Short Dopamine D2 receptor Drd2
Type:
G Protein-Coupled Receptor (GPCR)
Mol. Mass.:
50931.60
Organism:
Rattus norvegicus (rat)
Description:
P61169
Residue:
444
  
Inhibitor
Name:
BDBM50000579
Synonyms:
7-[4-(4-Hydroxy-piperidin-1-yl)-butoxy]-2-phenyl-chromen-4-one | CHEMBL288933
Type:
Small organic molecule
Emp. Form.:
C24H27NO4
Mol. Mass.:
393.4755
SMILES:
OC1CCN(CCCCOc2ccc3c(c2)oc(cc3=O)-c2ccccc2)CC1
: