Target
ALK tyrosine kinase receptor
Ligand
BDBM50240271
Substrate
Meas. Tech.
ChEMBL_1667903 (CHEMBL4017791)
IC50
0.330000±n/a nM
Citation
 Achary, RMathi, GRLee, DHYun, CSLee, COKim, HRPark, CHKim, PHwang, JY Novel 2,4-diaminopyrimidines bearing fused tricyclic ring moiety for anaplastic lymphoma kinase (ALK) inhibitor. Bioorg Med Chem Lett 27:2185-2191 (2017)  
Target
Name:
ALK tyrosine kinase receptor
Synonyms:
ALK ALK_HUMAN CD_antigen: CD246
Type:
Protein
Mol. Mass.:
176453.10
Organism:
Homo sapiens (Human)
Description:
Q9UM73
Residue:
1620
  
Inhibitor
Name:
BDBM50240271
Synonyms:
CHEMBL4101954
Type:
Small organic molecule
Emp. Form.:
C25H28ClN7O3S
Mol. Mass.:
542.053
SMILES:
COc1cc2N3CCNN=C3CCc2cc1Nc1ncc(Cl)c(Nc2ccccc2S(=O)(=O)C(C)C)n1
: