Target
Insulin receptor
Ligand
BDBM244039
Substrate
Meas. Tech.
ChEMBL_1667905 (CHEMBL4017793)
IC50
2.2±n/a nM
Citation
 Achary, RMathi, GRLee, DHYun, CSLee, COKim, HRPark, CHKim, PHwang, JY Novel 2,4-diaminopyrimidines bearing fused tricyclic ring moiety for anaplastic lymphoma kinase (ALK) inhibitor. Bioorg Med Chem Lett 27:2185-2191 (2017)  
Target
Name:
Insulin receptor
Synonyms:
INSR INSR_HUMAN Insulin receptor beta subunit
Type:
Receptor Tyrosine Kinase
Mol. Mass.:
156322.60
Organism:
Homo sapiens (Human)
Description:
P06213
Residue:
1382
  
Inhibitor
Name:
BDBM244039
Synonyms:
10-((5-chloro-4-(2-(isopropylsulfonyl)phenyl)aminopyrimidin-2-yl)amino)-9-methoxy-1,2,3,6,7,11b-hexahydro-4H-pyrazino[2,1-a]isoquinoline)-4-one | US10053458, 97
Type:
Small organic molecule
Emp. Form.:
C26H29ClN6O4S
Mol. Mass.:
557.064
SMILES:
COc1cc2CCN3C(CNCC3=O)c2cc1Nc1ncc(Cl)c(Nc2ccccc2S(=O)(=O)C(C)C)n1
: