Target
Insulin receptor
Ligand
BDBM50240272
Substrate
Meas. Tech.
ChEMBL_1667905 (CHEMBL4017793)
IC50
7.5±n/a nM
Citation
 Achary, RMathi, GRLee, DHYun, CSLee, COKim, HRPark, CHKim, PHwang, JY Novel 2,4-diaminopyrimidines bearing fused tricyclic ring moiety for anaplastic lymphoma kinase (ALK) inhibitor. Bioorg Med Chem Lett 27:2185-2191 (2017)  
Target
Name:
Insulin receptor
Synonyms:
INSR INSR_HUMAN Insulin receptor beta subunit
Type:
Receptor Tyrosine Kinase
Mol. Mass.:
156322.60
Organism:
Homo sapiens (Human)
Description:
P06213
Residue:
1382
  
Inhibitor
Name:
BDBM50240272
Synonyms:
CHEMBL4063965
Type:
Small organic molecule
Emp. Form.:
C28H29ClN6O5S
Mol. Mass.:
597.085
SMILES:
COc1cc2-c3c(C)n(nc3CCc2cc1Nc1ncc(Cl)c(Nc2ccccc2S(=O)(=O)C(C)C)n1)C(=O)CO
: