Target
Cytochrome P450 3A4
Ligand
BDBM50240278
Substrate
Meas. Tech.
ChEMBL_1667937 (CHEMBL4017825)
IC50
>50000±n/a nM
Citation
 Roecker, AJEgbertson, MJones, KLGGomez, RKraus, RLLi, YKoser, AJUrban, MOKlein, RClements, MPanigel, JDaley, CWang, JFinger, ENMajercak, JSantarelli, VGregan, ICato, MFilzen, TJovanovska, AWang, YHWang, DJoyce, LASherer, ECPeng, XWang, XSun, HColeman, PJHoughton, AKLayton, ME Discovery of selective, orally bioavailable, N-linked arylsulfonamide Na Bioorg Med Chem Lett 27:2087-2093 (2017)  
Target
Name:
Cytochrome P450 3A4
Synonyms:
Albendazole monooxygenase CP3A4_HUMAN CYP3A4 CYPIIIA4 Cytochrome P450 3A4 (CYP3A4) Nifedipine oxidase Taurochenodeoxycholate 6-alpha-hydroxylase
Type:
Enzyme
Mol. Mass.:
57349.57
Organism:
Homo sapiens (Human)
Description:
Residue:
503
  
Inhibitor
Name:
BDBM50240278
Synonyms:
CHEMBL4062780
Type:
Small organic molecule
Emp. Form.:
C19H24ClFN4O2S2
Mol. Mass.:
459.001
SMILES:
CC1(C)CN2CCC[C@]2(CNc2cc(F)c(cc2Cl)S(=O)(=O)Nc2nccs2)C1
: