Target
Cytochrome P450 2D6
Ligand
BDBM50240278
Substrate
Meas. Tech.
ChEMBL_1667939 (CHEMBL4017827)
IC50
3100±n/a nM
Citation
 Roecker, AJEgbertson, MJones, KLGGomez, RKraus, RLLi, YKoser, AJUrban, MOKlein, RClements, MPanigel, JDaley, CWang, JFinger, ENMajercak, JSantarelli, VGregan, ICato, MFilzen, TJovanovska, AWang, YHWang, DJoyce, LASherer, ECPeng, XWang, XSun, HColeman, PJHoughton, AKLayton, ME Discovery of selective, orally bioavailable, N-linked arylsulfonamide Na Bioorg Med Chem Lett 27:2087-2093 (2017)  
Target
Name:
Cytochrome P450 2D6
Synonyms:
CP2D6_HUMAN CYP2DL1 Cytochrome P450 2D6 (CYP2D6) P450-DB1
Type:
Protein
Mol. Mass.:
55774.82
Organism:
Homo sapiens (Human)
Description:
P10635
Residue:
497
  
Inhibitor
Name:
BDBM50240278
Synonyms:
CHEMBL4062780
Type:
Small organic molecule
Emp. Form.:
C19H24ClFN4O2S2
Mol. Mass.:
459.001
SMILES:
CC1(C)CN2CCC[C@]2(CNc2cc(F)c(cc2Cl)S(=O)(=O)Nc2nccs2)C1
: