Target
Sodium channel protein type 5 subunit alpha
Ligand
BDBM50240278
Substrate
Meas. Tech.
ChEMBL_1667927 (CHEMBL4017815)
IC50
>30000±n/a nM
Citation
 Roecker, AJEgbertson, MJones, KLGGomez, RKraus, RLLi, YKoser, AJUrban, MOKlein, RClements, MPanigel, JDaley, CWang, JFinger, ENMajercak, JSantarelli, VGregan, ICato, MFilzen, TJovanovska, AWang, YHWang, DJoyce, LASherer, ECPeng, XWang, XSun, HColeman, PJHoughton, AKLayton, ME Discovery of selective, orally bioavailable, N-linked arylsulfonamide Na Bioorg Med Chem Lett 27:2087-2093 (2017)  
Target
Name:
Sodium channel protein type 5 subunit alpha
Synonyms:
HH1 SCN5A_HUMAN Sodium channel protein type 5 subunit alpha/beta-1/beta-2 Voltage-gated sodium channel subunit alpha Nav1.5
Type:
Enzyme
Mol. Mass.:
226908.60
Organism:
Homo sapiens (Human)
Description:
Q14524
Residue:
2016
  
Inhibitor
Name:
BDBM50240278
Synonyms:
CHEMBL4062780
Type:
Small organic molecule
Emp. Form.:
C19H24ClFN4O2S2
Mol. Mass.:
459.001
SMILES:
CC1(C)CN2CCC[C@]2(CNc2cc(F)c(cc2Cl)S(=O)(=O)Nc2nccs2)C1
: