Target
Glucose-dependent insulinotropic receptor
Ligand
BDBM50240388
Substrate
Meas. Tech.
ChEMBL_1668157 (CHEMBL4018045)
EC50
1.80±n/a nM
Citation
 Yang, ZFang, YPark, H Synthesis and biological evaluation of pyrimidine derivatives with diverse azabicyclic ether/amine as novel GPR119 agonist. Bioorg Med Chem Lett 27:2515-2519 (2017)  
Target
Name:
Glucose-dependent insulinotropic receptor
Synonyms:
G-protein coupled receptor 119 (GPR119) GPR119 | Glucose-dependent insulinotropic receptor
Type:
Protein
Mol. Mass.:
36901.49
Organism:
Homo sapiens (Human)
Description:
Q8TDV5
Residue:
335
  
Inhibitor
Name:
BDBM50240388
Synonyms:
CHEMBL4078300
Type:
Small organic molecule
Emp. Form.:
C23H29FN6O6S
Mol. Mass.:
536.576
SMILES:
CC(C)(C)OC(=O)N1CC2CCC1CC2Nc1ncnc(Nc2ccc(cc2F)S(C)(=O)=O)c1[N+]([O-])=O
: