Target
Meprin A subunit beta
Ligand
BDBM50240400
Substrate
Meas. Tech.
ChEMBL_1668162 (CHEMBL4018050)
IC50
37500±n/a nM
Citation
 Ramsbeck, DHamann, ASchlenzig, DSchilling, SBuchholz, M First insight into structure-activity relationships of selective meprin? inhibitors. Bioorg Med Chem Lett 27:2428-2431 (2017)  
Target
Name:
Meprin A subunit beta
Synonyms:
3.4.24.63 MEP1B Meprin A subunit beta N-benzoyl-L-tyrosyl-P-amino-benzoic acid hydrolase subunit beta PPH beta
Type:
PROTEIN
Mol. Mass.:
79560.71
Organism:
Homo sapiens
Description:
ChEMBL_117484
Residue:
701
  
Inhibitor
Name:
BDBM50240400
Synonyms:
CHEMBL4080850
Type:
Small organic molecule
Emp. Form.:
C13H20N2O5S
Mol. Mass.:
316.373
SMILES:
CCCCN(CC(=O)NO)S(=O)(=O)c1ccc(OC)cc1
: