Target
Meprin A subunit beta
Ligand
BDBM13098
Substrate
Meas. Tech.
ChEMBL_1668162 (CHEMBL4018050)
IC50
38800±n/a nM
Citation
 Ramsbeck, DHamann, ASchlenzig, DSchilling, SBuchholz, M First insight into structure-activity relationships of selective meprin? inhibitors. Bioorg Med Chem Lett 27:2428-2431 (2017)  
Target
Name:
Meprin A subunit beta
Synonyms:
3.4.24.63 MEP1B Meprin A subunit beta N-benzoyl-L-tyrosyl-P-amino-benzoic acid hydrolase subunit beta PPH beta
Type:
PROTEIN
Mol. Mass.:
79560.71
Organism:
Homo sapiens
Description:
ChEMBL_117484
Residue:
701
  
Inhibitor
Name:
BDBM13098
Synonyms:
CGS 27023A Analog 26 | N-hydroxy-2-[(4-methoxybenzene)(3-methylbutyl)sulfonamido]acetamide
Type:
Small organic molecule
Emp. Form.:
C14H22N2O5S
Mol. Mass.:
330.4
SMILES:
COc1ccc(cc1)S(=O)(=O)N(CCC(C)C)CC(=O)NO
: