Target
Wee1-like protein kinase
Ligand
BDBM31545
Substrate
Meas. Tech.
ChEMBL_1668979 (CHEMBL4018867)
Kd
14±n/a nM
Citation
 Zhu, JYCuellar, RABerndt, NLee, HEOlesen, SHMartin, MPJensen, JTGeorg, GISchönbrunn, E Structural Basis of Wee Kinases Functionality and Inactivation by Diverse Small Molecule Inhibitors. J Med Chem 60:7863-7875 (2017)  
Target
Name:
Wee1-like protein kinase
Synonyms:
Serine/threonine-protein kinase WEE1 WEE1 homolog (S. pombe) | WEE1_HUMAN
Type:
PROTEIN
Mol. Mass.:
71599.12
Organism:
Homo sapiens (Human)
Description:
ChEMBL_1445054
Residue:
646
  
Inhibitor
Name:
BDBM31545
Synonyms:
Milciclib | pyrazolo[4,3-h]quinazoline-3-carboxamide, 28
Type:
Small organic molecule
Emp. Form.:
C25H32N8O
Mol. Mass.:
460.5746
SMILES:
CNC(=O)c1nn(C)c-2c1C(C)(C)Cc1cnc(Nc3ccc(cc3)N3CCN(C)CC3)nc-21
: