Target
Neuropeptide Y receptor type 4
Ligand
BDBM50240829
Substrate
Meas. Tech.
ChEMBL_1669019 (CHEMBL4018907)
EC50
0.501187±n/a nM
Citation
 Schubert, MStichel, JDu, YTough, IRSliwoski, GMeiler, JCox, HMWeaver, CDBeck-Sickinger, AG Identification and Characterization of the First Selective Y J Med Chem 60:7605-7612 (2017)  
Target
Name:
Neuropeptide Y receptor type 4
Synonyms:
NPY-Y4 NPY4R PP1 Pancreatic polypeptide receptor 1
Type:
Enzyme Catalytic Domain
Mol. Mass.:
42207.58
Organism:
Homo sapiens (Human)
Description:
NPY-Y4 PPYR1 HUMAN::P50391
Residue:
375
  
Inhibitor
Name:
BDBM50240829
Synonyms:
CHEMBL3559801
Type:
Small organic molecule
Emp. Form.:
C16H24O2
Mol. Mass.:
248.3606
SMILES:
CC(C)(C)c1ccc(OC2CCCCC2O)cc1
: