Target
Mitogen-activated protein kinase 14
Ligand
BDBM50241001
Substrate
Meas. Tech.
ChEMBL_1669518 (CHEMBL4019406)
Kd
1.2±n/a nM
Citation
 Walter, NMWentsch, HKBührmann, MBauer, SMDöring, EMayer-Wrangowski, SSievers-Engler, AWillemsen-Seegers, NZaman, GBuijsman, RLämmerhofer, MRauh, DLaufer, SA Design, Synthesis, and Biological Evaluation of Novel Type I J Med Chem 60:8027-8054 (2017)  
Target
Name:
Mitogen-activated protein kinase 14
Synonyms:
CSAID-binding protein CSBP1 CSPB1 MAP kinase 14 MAP kinase p38 alpha MAPK14 MK14_HUMAN Mitogen-activated protein kinase p38 alpha Stress-activated protein kinase 2a | p38 MAP kinase alpha/beta
Type:
Serine/threonine-protein kinase
Mol. Mass.:
41286.76
Organism:
Homo sapiens (Human)
Description:
Q16539
Residue:
360
  
Inhibitor
Name:
BDBM50241001
Synonyms:
CHEMBL4082844
Type:
Small organic molecule
Emp. Form.:
C29H24FN3O6S
Mol. Mass.:
561.581
SMILES:
OCC(O)CNC(=O)c1ccc2COc3cc(Nc4ccc(F)c(NC(=O)c5cccs5)c4)ccc3C(=O)c2c1
: